我今天安了一个mysql,下载一个源码包,感觉很简单,tar./configuremakemake install 经典四步,弄这个也不是第一次了,但今天就是老出错,首先是./configure中:


checking for tgetent in -ltermcap... no

checking for tgetent in -ltinfo... no

checking for termcap functions library... configure: error: No curses/termcap library found


可是我gcc都装了呀,于是看到网上的安装环境,yum一大堆,然后我傻乎乎的就去安了

yum installcmake makegcc gcc-c++ libjpeg libjpeg-devel libpng \
libpng-devel freetype freetype-devel libxml2 libxml2-devel zlib zlib-devel glibc \
glibc-devel glib2 glib2-devel bzip2bzip2-devel ncurses ncurses-devel curl \
curl-devel e2fsprogs e2fsprogs-devel krb5-devel libidn libidn-devel openssl expat expat-devel \
openssl-devel nss_ldap openldap openldap-devel openldap-clients openldap-servers unixODBC-devel \

libxslt-devel libevent-devel libtool-ltdl bison libtool pcre-devel zip unzip gmp-devel gd gd-devel


费了半天劲,终于写完了,可是我的网络yum没有那么多包,上面有一半是error,找了别的yum也不行,所以,第一次,失败。

然后上网上查了一下,是缺少ncurses安装包,然后我就:


yum list|grep ncurses

yum -y install ncurses-devel


本来以为解决了,可是谁知道我的网络yum没有这个包,今天好悲催.......


然后我只能找tar包安装了,于是乎


wget http://ftp.gnu.org/pub/gnu/ncurses/ncurses-5.6.tar.gz
tar zxvf  ncurses-5.6.tar.gz
cd ncurses-5.6
./configure –prefix=/usr --without-ada --enable-overwrite

make
make install
然后再重新编译Mysql进行安装。


可是:

tic: symbol lookup error: tic: undefined symbol: _nc_check_termtype2
? tic could not build /usr/share/terminfo
make[1]: *** [install.data] Error 1
make[1]: Leaving directory `/lamp/ncurses-5.6/misc'
make: *** [install] Error 2

还是报错,不过这时我都麻木了,反正全是bug,也不多这一两个,于是乎,接着查,黄天不复有心人,下载个新版本,如ncurses 5.9就可以解决。安装方法可以完全按照经典四步就解决了用tar包不能安装的问题。

./configure --with-shared --without-debug --without-ada --enable-overwrite

wget http://ftp.gnu.org/pub/gnu/ncurses/ncurses-5.9.tar.gz